{"text_format":"1","workbook":"xlsx","n_sheets":7,"sheets":["Timetable","Budget","Example","ExchRate","data","model","ERdata"],"not_rendered":{"charts":0,"images":0,"macros":1,"external_links":1,"defined_names":11,"comments":1,"pivot_tables":0},"unopened":[],"bounds":{"document_bytes":16777216,"sheet_cells":100000,"rows_first":2000,"rows_last":500,"rows_between":2000,"halvings":0,"cell_chars":16384,"cell_head_chars":4096},"cells_cut":0,"cells_raw":0,"read":"whole","date_system":"1900"}

{"sheet":"Timetable","index":0,"n_rows":20,"n_cols":38,"rows_kept":20,"cut":false,"hidden":false,"merged":[[3,0,3,1],[4,2,4,13],[4,14,4,25],[4,26,4,37]]}
[null,"State:","BELARUS"]
[null,"File number:"]
[null,"Title:","Spring rire of 'Yurauski Karahod'"]
["Go to budget"]
[null,null,"Year 1: ",null,null,null,null,null,null,null,null,null,null,null,"Year 2: ",null,null,null,null,null,null,null,null,null,null,null,"Year 3: "]
["#","Activities",1,2,3,4,5,6,7,8,9,10,11,12,1,2,3,4,5,6,7,8,9,10,11,12,1,2,3,4,5,6,7,8,9,10,11,12]
[]
[{"$f":"IF(B8=\"\",\"\",COUNTA(B$8:B20)-(COUNTA(B8:B20)-1))","v":1},"Management and coordination system "]
[{"$f":"IF(B9=\"\",\"\",COUNTA(B$8:B21)-(COUNTA(B9:B21)-1))","v":2},"Start-up and final meetings"]
[{"$f":"IF(B10=\"\",\"\",COUNTA(B$8:B22)-(COUNTA(B10:B22)-1))","v":3},"Mapping  and inventorying of ICH in Turau area"]
[{"$f":"IF(B11=\"\",\"\",COUNTA(B$8:B23)-(COUNTA(B11:B23)-1))","v":4},"Elaboration and publication of ICH Anthology of Turau area"]
[{"$f":"IF(B12=\"\",\"\",COUNTA(B$8:B24)-(COUNTA(B12:B24)-1))","v":5},"Developing a safeguarding and revitalizatiion strategy of the Jurauski Karahod element"]
[{"$f":"IF(B13=\"\",\"\",COUNTA(B$8:B25)-(COUNTA(B13:B25)-1))","v":6},"Running the ICH festival in Pahost villahe"]
[{"$f":"IF(B14=\"\",\"\",COUNTA(B$8:B26)-(COUNTA(B14:B26)-1))","v":7},"The dissemination of information by media and social networks"]
[{"$f":"IF(B15=\"\",\"\",COUNTA(B$8:B27)-(COUNTA(B15:B27)-1))","v":8},"Student's Folklore Summer School"]
[{"$f":"IF(B16=\"\",\"\",COUNTA(B$8:B28)-(COUNTA(B16:B28)-1))","v":9},"Setting-up a Local Centre of Traditions in Pahost "]
[{"$f":"IF(B17=\"\",\"\",COUNTA(B$8:B29)-(COUNTA(B17:B29)-1))","v":10},"Creating traditional costumes"]
[{"$f":"IF(B18=\"\",\"\",COUNTA(B$8:B30)-(COUNTA(B18:B30)-1))","v":11},"Capacity building for local communities (4 workshops)"]
[{"$f":"IF(B19=\"\",\"\",COUNTA(B$8:B31)-(COUNTA(B19:B31)-1))","v":12},"Summing-up and reporting"]
[{"$f":"IF(B20=\"\",\"\",COUNTA(B$8:B32)-(COUNTA(B20:B32)-1))","v":""}]

{"sheet":"Budget","index":1,"n_rows":61,"n_cols":7,"rows_kept":61,"cut":false,"hidden":false,"merged":[]}
["Go to timetable",null,null,null,null,"Exchange Rate","Example"]
[null,"TOTAL AMOUNT (in US$):",{"$f":"SUMIF($B:$B,\"Sub-total:\",C:C)","v":87760.5},{"$f":"SUMIF($B:$B,\"Sub-total:\",D:D)","v":4009},{"$f":"SUMIF($B:$B,\"Sub-total:\",E:E)","v":9780},{"$f":"SUMIF($B:$B,\"Sub-total:\",F:F)","v":101549.5}]
[null,"Percentage of the total amount:",{"$f":"IFERROR($C$2/$F$2,\"\")","v":0.86421400400789761},{"$f":"IFERROR($D$2/$F$2,\"\")","v":3.9478283989581434E-2},{"$f":"IFERROR($E$2/$F$2,\"\")","v":9.6307712002520932E-2},{"$f":"IFERROR($F$2/$F$2,\"\")","v":1}]
["Activity: (indicate the activity and the type of expenditure)","Description: (give full details of calculations)","ICH Fund (in US$)","State Party (in US$)","Others (in US$)","Total (in US$)","Additional comments"]
["Management and coordination system ","Sub-total:",{"$f":"SUBTOTAL(9,C6:C6)","v":0},{"$f":"SUBTOTAL(9,D6:D6)","v":0},{"$f":"SUBTOTAL(9,E6:E6)","v":0},{"$f":"SUBTOTAL(9,F6:F6)","v":0}]
["It is provided by the project team, including specialists and consultants (51-56 lines of the budget) and through the use of local experts and volunteers",null,0,0,0,{"$f":"SUM(C6:E6)","v":0}]
["Start-up and final meetings","Sub-total:",{"$f":"SUBTOTAL(9,C8:C10)","v":980},{"$f":"SUBTOTAL(9,D8:D10)","v":0},{"$f":"SUBTOTAL(9,E8:E10)","v":120},{"$f":"SUBTOTAL(9,F8:F10)","v":1100}]
["Rent a room / Rental venue","Rent of venue for 50 paricipants. 2 meetings x 4 hours x 15 $ a hour ",0,0,120,{"$f":"SUM(C8:E8)","v":120},"Provided by local authority"]
["Hospitality","Coffee -breaks (2) for 50 participants x 5$",500,0,0,{"$f":"SUM(C9:E9)","v":500},"Estimation: 5$ for a person"]
["Travel expenses for experts","Per diem for 4 experts (Minsk-Pahost-Turau-Minsk x 2 days x 60 $ (including transportations",480,0,0,{"$f":"SUM(C10:E10)","v":480}]
["Mapping and inventorying  of ICH in Turau area","Sub-total:",{"$f":"SUBTOTAL(9,C12:C12)","v":3840},{"$f":"SUBTOTAL(9,D12:D12)","v":0},{"$f":"SUBTOTAL(9,E12:E12)","v":0},{"$f":"SUBTOTAL(9,F12:F12)","v":3840}]
["Travel expenses (around Turau area, 300 km), expedition","Rent of bus for 12 participants, 8 days (100$ per day (8 hours) = 800$; Accomodation (8 persons x 7 days x 20$)= 1120$; Per diem (12 persons x 8 days x 20%)=1920$",3840,0,0,{"$f":"SUM(C12:E12)","v":3840},"8 participants -experts + 4 local representatives"]
["Elaboration and publication of ICH Anthology of Turau area","Sub-total:",{"$f":"SUBTOTAL(9,C14:C15)","v":7100},{"$f":"SUBTOTAL(9,D14:D15)","v":0},{"$f":"SUBTOTAL(9,E14:E15)","v":0},{"$f":"SUBTOTAL(9,F14:F15)","v":7100}]
["Processing of material, including mapping, compilation and editing of text, design and layout of the publication","Fees for proceccing materials and text compilation and editing (500 $), mapping (300$), design and layout - 1200$",2000,0,0,{"$f":"SUM(C14:E14)","v":2000},"Survey price"]
["Printing the edition","Printing service, 100 pages, 300 copies x 17$",5100,0,0,{"$f":"SUM(C15:E15)","v":5100},"12 $ for one copy of the edition"]
["Running the ICH festival in Pahost villahe","Sub-total:",{"$f":"SUBTOTAL(9,C17:C21)","v":20000},{"$f":"SUBTOTAL(9,D17:D21)","v":2000},{"$f":"SUBTOTAL(9,E17:E21)","v":4000},{"$f":"SUBTOTAL(9,F17:F21)","v":26000}]
["Meals for participants, 300 persons (musicians, creftsmen, students)","300 persons x 25 $ x 2 days ",15000,0,0,{"$f":"SUM(C17:E17)","v":15000}]
["Awards for ICH bearers","10 awards x  50$ in average",500,0,0,{"$f":"SUM(C18:E18)","v":500}]
["Leaflet of the festival","500 copies x 3$",1500,0,0,{"$f":"SUM(C19:E19)","v":1500},"Promotional leaflet with the festival programme"]
["Accommodation of paricipants","300 persons x 20 $ x 1 day",3000,2000,1000,{"$f":"SUM(C20:E20)","v":6000},"Partly provided by the Ministry of culture and local authority and sponsors"]
["Organizational expenses ","Organization of place, equipment, decoration, human recourses",0,0,3000,{"$f":"SUM(C21:E21)","v":3000},"Provided by local authority and sponsors"]
["The dissemination of information by media and social networks","Sub-total:",{"$f":"SUBTOTAL(9,C23:C25)","v":1900},{"$f":"SUBTOTAL(9,D23:D25)","v":2000},{"$f":"SUBTOTAL(9,E23:E25)","v":0},{"$f":"SUBTOTAL(9,F23:F25)","v":3900}]
["Articles in national, regional and local press","4 articles x 100$ for article",400,0,0,{"$f":"SUM(C23:E23)","v":400}]
["TV programmes ","2 TV programmes created x 1000$",0,2000,0,{"$f":"SUM(C24:E24)","v":2000},"Provided by Ministry of Culture"]
["Moderation of Turau Local Histort Museum' website and creation of a page about Pahost village ICH","Elaboration of the design and soft (price for service - 1000 $, context of the mentioned page -- 500$)",1500,0,0,{"$f":"SUM(C25:E25)","v":1500},"In cooperation with local experts and local youth."]
["Student's Folklore Summer School","Sub-total:",{"$f":"SUBTOTAL(9,C27:C32)","v":9303},{"$f":"SUBTOTAL(9,D27:D32)","v":0},{"$f":"SUBTOTAL(9,E27:E32)","v":0},{"$f":"SUBTOTAL(9,F27:F32)","v":9303}]
["Rent of bus (Minsk-Pahost-Minsk)","Rent of bus for 20 students and 2 teachers (Minsk-Pahost-Minsk), 650 km x 0,46 cent = 299 $",299,0,0,{"$f":"SUM(C27:E27)","v":299}]
["Rent of bus for travel in area (2 days), local transport","2 days across area, 200 km x 0.46 cent = 92$",184,0,0,184,"one-off trips with a fact-finding mission to neighboring towns and villages"]
["Meals ","22 persons x 7 days x 25$ (a day)",3840,0,0,3840]
["Accommodation for paricipants","22 persons x 6 nights x 20$",2640,0,0,2640]
["Lectures for students and local people (4)","Fees for lectors (4 x 150$)+travel expenses for lectors (4 x 60$x 1 day)",840,0,0,840]
["Publication as a result of Student Summer School","Preparing, layout and printing, 60 pages, 100 copies, 1 copy is 15$",1500,0,0,1500]
["Setting-up a Local Centre of Traditions in Pahost ","Sub-total:",{"$f":"SUBTOTAL(9,C34:C41)","v":6130},{"$f":"SUBTOTAL(9,D34:D41)","v":9},{"$f":"SUBTOTAL(9,E34:E41)","v":5300},{"$f":"SUBTOTAL(9,F34:F41)","v":11439}]
["Repair of premises for the opening of the center","Service price: painting walls, including the cost of paint - $ 800; laminate flooring, including the cost of the material (100 sq. m. x 35 $ per 1 sq. m = 3500 $);\npainting the ceiling (100 sq. m. x 10 $ for 1 sq. m = 1000 $)",0,0,5300,{"$f":"SUM(C34:E34)","v":5300},"Provided for local authority resources and sponsorship"]
["Purchase of equipment: Photo camera Canon EQS 5D Body","Average Price for Belarus",1200,0,0,1200,"This item is needed for organization of survey and for documenting"]
["Video-projector Epson MG 850HD, LCD, WXGA (1280x800)","Average Price for Belarus",880,0,0,880,"This item is needed for organization of workshops"]
["Computer block","Average Price for Belarus",880,0,0,880,"This item is needed for organization of workshops and for documenting"]
["Notebook HP ProBook 450G5 2RS03EA","Average Price for Belarus",730,0,0,730,"This item is needed for organization of workshops and for documenting"]
["Screen CACTUS triscreen CS-PST-124x221","Average Price for Belarus",150,0,0,150,"This item is needed for organization of workshops"]
["Flip chart","Average Price for Belarus",130,0,0,130,"This item is needed for organization of workshops"]
{"$rows_left_out":22}
{"sheet":"Example","index":2,"n_rows":15,"n_cols":7,"rows_kept":15,"cut":false,"hidden":false,"merged":[]}
["Go to timetable","TOTAL AMOUNT (in US$):",{"$f":"SUMIF($B:$B,\"Sub-total:\",C:C)","v":1000},{"$f":"SUMIF($B:$B,\"Sub-total:\",D:D)","v":200},{"$f":"SUMIF($B:$B,\"Sub-total:\",E:E)","v":900},{"$f":"SUMIF($B:$B,\"Sub-total:\",F:F)","v":2100},"Go to budget"]
[null,"Percentage of the total amount:",{"$f":"IFERROR($C$1/$F$1,\"\")","v":0.47619047619047616},{"$f":"IFERROR($D$1/$F$1,\"\")","v":9.5238095238095233E-2},{"$f":"IFERROR($E$1/$F$1,\"\")","v":0.42857142857142855},{"$f":"IFERROR($F$1/$F$1,\"\")","v":1}]
["Activity: (click on the blue cells below to indicate your activities, then click on the white cells to select the appropriate expenditure from the list)","Description: (give full details of calculations)","ICH Fund (in US$)","State Party (in US$)","Others (in US$)","Total (in US$)","Additional comments"]
["Ex: Training Workshop on inventories","Sub-total:",{"$f":"SUBTOTAL(9,C5:C8)","v":1000},{"$f":"SUBTOTAL(9,D5:D8)","v":200},{"$f":"SUBTOTAL(9,E5:E8)","v":900},{"$f":"SUBTOTAL(9,F5:F8)","v":2100}]
["Rent a room / Rental venue",{"$f":"IF(ISNA(VLOOKUP(A5,data!A:B,2,FALSE)),\"\",(VLOOKUP(A5,data!A:B,2,FALSE)))","v":"Rental of a meeting room (capacity 50 persons) for the workshop participants during three days"},{"$f":"IF(ISNA(VLOOKUP(A5,data!A:C,3,FALSE)),\"\",(VLOOKUP(A5,data!A:C,3,FALSE)))","v":0},{"$f":"IF(ISNA(VLOOKUP(A5,data!A:D,4,FALSE)),\"\",(VLOOKUP(A5,data!A:D,4,FALSE)))","v":0},{"$f":"IF(ISNA(VLOOKUP(A5,data!A:E,5,FALSE)),\"\",(VLOOKUP(A5,data!A:E,5,FALSE)))","v":700},{"$f":"SUM(C5:E5)","v":700},{"$f":"IF(ISNA(VLOOKUP(A5,data!A:G,6,FALSE)),\"\",(VLOOKUP(A5,data!A:G,6,FALSE)))","v":"US$350 provided by ABC Foundation and US$350 provided by DEF Association"}]
["Hospitality",{"$f":"IF(ISNA(VLOOKUP(A6,data!A:B,2,FALSE)),\"\",(VLOOKUP(A6,data!A:B,2,FALSE)))","v":"1 coffee break for each workshop 1000, $ 500 * 2 = $ 1000"},{"$f":"IF(ISNA(VLOOKUP(A6,data!A:C,3,FALSE)),\"\",(VLOOKUP(A6,data!A:C,3,FALSE)))","v":1000},{"$f":"IF(ISNA(VLOOKUP(A6,data!A:D,4,FALSE)),\"\",(VLOOKUP(A6,data!A:D,4,FALSE)))","v":0},{"$f":"IF(ISNA(VLOOKUP(A6,data!A:E,5,FALSE)),\"\",(VLOOKUP(A6,data!A:E,5,FALSE)))","v":0},{"$f":"SUM(C6:E6)","v":1000},{"$f":"IF(ISNA(VLOOKUP(A6,data!A:G,6,FALSE)),\"\",(VLOOKUP(A6,data!A:G,6,FALSE)))","v":"Estimation $ 5 / person"}]
["Interpretation",{"$f":"IF(ISNA(VLOOKUP(A7,data!A:B,2,FALSE)),\"\",(VLOOKUP(A7,data!A:B,2,FALSE)))","v":"Fees and per diem for two interpretors, US$100 per hour, 2 hours each"},{"$f":"IF(ISNA(VLOOKUP(A7,data!A:C,3,FALSE)),\"\",(VLOOKUP(A7,data!A:C,3,FALSE)))","v":0},{"$f":"IF(ISNA(VLOOKUP(A7,data!A:D,4,FALSE)),\"\",(VLOOKUP(A7,data!A:D,4,FALSE)))","v":200},{"$f":"IF(ISNA(VLOOKUP(A7,data!A:E,5,FALSE)),\"\",(VLOOKUP(A7,data!A:E,5,FALSE)))","v":200},{"$f":"SUM(C7:E7)","v":400},{"$f":"IF(ISNA(VLOOKUP(A7,data!A:G,6,FALSE)),\"\",(VLOOKUP(A7,data!A:G,6,FALSE)))","v":"the meeting is expected to take two hours maximum time"}]
[null,"Sub-total:",{"$f":"SUBTOTAL(9,C9:C12)","v":0},{"$f":"SUBTOTAL(9,D9:D12)","v":0},{"$f":"SUBTOTAL(9,E9:E12)","v":0},{"$f":"SUBTOTAL(9,F9:F12)","v":0}]
[null,null,null,null,null,{"$f":"SUM(C9:E9)","v":0}]
[null,null,null,null,null,{"$f":"SUM(C10:E10)","v":0}]
[null,null,null,null,null,{"$f":"SUM(C11:E11)","v":0}]
[null,"Sub-total:",{"$f":"SUBTOTAL(9,C13:C16)","v":0},{"$f":"SUBTOTAL(9,D13:D16)","v":0},{"$f":"SUBTOTAL(9,E13:E16)","v":0},{"$f":"SUBTOTAL(9,F13:F16)","v":0}]
[null,null,null,null,null,{"$f":"SUM(C13:E13)","v":0}]
[null,null,null,null,null,{"$f":"SUM(C14:E14)","v":0}]
[null,null,null,null,null,{"$f":"SUM(C15:E15)","v":0}]

{"sheet":"ExchRate","index":3,"n_rows":11,"n_cols":7,"rows_kept":11,"cut":false,"hidden":false,"merged":[[1,0,1,5],[0,0,0,5]]}
["OPERATIONAL RATES OF EXCHANGE FOR UNITED NATIONS PROGRAMMES  -  2017",null,null,null,null,null,"Go to budget"]
["(EQUIVALENT IN UNIT PER US DOLLAR)"]
[]
["Chose Country from the list:"]
["Local currency:",{"$f":"IF(ISNA(VLOOKUP(B4,ERdata!A:C,3,FALSE)),\"-\",(VLOOKUP(B4,ERdata!A:C,3,FALSE)))","v":"-"}]
["UN Monthly Rate for 1 US DOLLAR:",{"$f":"IF(ISNA(VLOOKUP(B4,ERdata!A:D,4,FALSE)),\"-\",(VLOOKUP(B4,ERdata!A:D,4,FALSE)))","v":"-"},{"$f":"ERdata!D4","v":"2017-09-01"}]
[]
["Amount in Local Currency:"]
["Equivalent in US DOLLAR:",{"$f":"IFERROR(B8/B6,\"-\")","v":"-"}]
[]
["*Please note that the conversion rate is that of the month at the time the file is downloaded and will be valid for that month only."]

{"sheet":"data","index":4,"n_rows":55,"n_cols":6,"rows_kept":55,"cut":false,"hidden":true,"merged":[]}
[null,null,"Amount requested to the ICH Fund (in USD)","State Party Funds (in USD)","Other sources (in USD)","Comments"]
["1. Workshop, seminars and meetings","select an item, if applicable"]
["Audio-Visual Equipment","2 recorders at US$100 / unit",100,100,0,"Sony recorder XYZ"]
["Hospitality","1 coffee break for each workshop 1000, $ 500 * 2 = $ 1000",1000,0,0,"Estimation $ 5 / person"]
["Interpretation","Fees and per diem for two interpretors, US$100 per hour, 2 hours each",0,200,200,"the meeting is expected to take two hours maximum time"]
["Rent a room / Rental venue","Rental of a meeting room (capacity 50 persons) for the workshop participants during three days",0,0,700,"US$350 provided by ABC Foundation and US$350 provided by DEF Association"]
["Stationery","Paper and pens for the workshop",500,0,0," "]
["Translation, editing and printing","Translation of training materials: $ 30 / page, 200 pages",0,6000,0," "]
["Other training costs (specify)"]
[]
["2. Staff / Advisory services (fees)","select an item, if applicable"]
["Administrative Assistance","$ 500 / month for 6 months",2000,1000,null,"secretary"]
["Auditor / Evaluator","Fees for two evaluators for 15 days each",1500,0,0," "]
["Consultant","$ __ / week for__ week(s)",null,null,null,"Expert, interpreter, computer assistant, driver"]
["Coordinator","3 people at $ 30 per day for 10 days to complete the program",450,0,450,"Coordination costs financed by the EFG Institute"]
["International / national personnel","$ __ / week for__ week(s)"]
["Facilitator"]
["Researcher"]
["Trainers"]
["Other personnel costs (specify)","Costs for demonstration and performance",0,500]
[]
["3. Travel costs","select an item, if applicable"]
["Accommodation","for one project coordinator x $ 40 per day x 5 days",200,0,0," "]
["Domestic travel","Roundtrip to Village C (3 people) $ 400 / ticket",0,0,1200,"Air tickets financed by the Organization HIJ"]
["Fuel"]
["International travel","$ 1,500 / ticket for 2 people",3000,0,0," "]
["Meals","for one project coordinator x $ 20 per day x 5 days",100,0,0," "]
["Per diem (lodging, meals and incidentals)","For the coordination team, 3 people x $ 60 per day x 10 days",1800,0,0," "]
["Visa fees","$ 90 for 3 participants",270,0,0," "]
["Other travel costs (specify)","Transportation for members of the survey team, 14 people x $ 20 per day x 10 days",2300,500,0]
[]
["4. Equipment / Material","select an item, if applicable"]
["Audiovisual material","2 digital cameras at $ 400 / unit",800,0,0,"Purchase of two digital cameras for field investigation"]
["Banners & Graphic material"]
["Laptop computer","Laptop samsung XYZ",null,null,null,"Computer Purchase for field investigation"]
["Printer","Laser printer KLM"]
["Project vehicles"]
["Recorder"]
["Rental service","Renting a projector",300,null,null," "]
["Repair and maintenance services"]
{"$rows_left_out":16}
{"sheet":"model","index":5,"n_rows":4,"n_cols":6,"rows_kept":4,"cut":false,"hidden":true,"merged":[]}
[]
[]
[null,"Sub-total:",null,null,null,0]
[null,null,null,null,null,{"$f":"SUM(C4:E4)","v":0}]

{"sheet":"ERdata","index":6,"n_rows":213,"n_cols":4,"rows_kept":213,"cut":false,"hidden":true,"merged":[]}
["7OPERATIONAL RATES OF EXCHANGE FOR UNITED NATIONS PROGRAMMES  -  2017"]
["(EQUIVALENT IN UNIT PER US DOLLAR)"]
[]
["COUNTRY","CURRENCY",null,{"$f":"LOOKUP(9^9,[1]Exch2017!$A$4:$AB$4)","v":"2017-09-01"}]
["Afghanistan","Afghani","AFN",{"$f":"LOOKUP(9^9,[1]Exch2017!A5:IV5)","v":68.34}]
["Albania","Lek","ALL",{"$f":"LOOKUP(9^9,[1]Exch2017!A6:IV6)","v":111.45}]
["Algeria","Dinar","DZD",{"$f":"LOOKUP(9^9,[1]Exch2017!A7:IV7)","v":110.05970000000001}]
["Andorra","Euro","EUR",{"$f":"LOOKUP(9^9,[1]Exch2017!A8:IV8)","v":0.83199999999999996}]
["Angola","Kwanza Reaj.","AOA",{"$f":"LOOKUP(9^9,[1]Exch2017!A9:IV9)","v":165.1}]
["Antigua and Barbuda","EC Dollar","XCD",{"$f":"LOOKUP(9^9,[1]Exch2017!A10:IV10)","v":2.7}]
["Argentina","Peso","ARS",{"$f":"LOOKUP(9^9,[1]Exch2017!A11:IV11)","v":17.263000000000002}]
["Armenia","Drum","AMD",{"$f":"LOOKUP(9^9,[1]Exch2017!A12:IV12)","v":479.5}]
["Aruba","Aruba Guilder","AWG",{"$f":"LOOKUP(9^9,[1]Exch2017!A13:IV13)","v":1.79}]
["Australia","Australian Dollar","AUD",{"$f":"LOOKUP(9^9,[1]Exch2017!A14:IV14)","v":1.2549999999999999}]
["Austria","Euro","EUR",{"$f":"LOOKUP(9^9,[1]Exch2017!A15:IV15)","v":0.83199999999999996}]
["Azerbaijan","New Azerbaijan Manat","AZN",{"$f":"LOOKUP(9^9,[1]Exch2017!A16:IV16)","v":1.6919999999999999}]
["Bahamas","Bahamian Dollar","BSD",{"$f":"LOOKUP(9^9,[1]Exch2017!A17:IV17)","v":1}]
["Bahrain","Dinar","BHD",{"$f":"LOOKUP(9^9,[1]Exch2017!A18:IV18)","v":0.37708000000000003}]
["Bangladesh","Taka","BDT",{"$f":"LOOKUP(9^9,[1]Exch2017!A19:IV19)","v":81.224999999999994}]
["Barbados","Barbados Dollar","BBD",{"$f":"LOOKUP(9^9,[1]Exch2017!A20:IV20)","v":2}]
["Belarus","New Belarusian Ruble","BYN",{"$f":"LOOKUP(9^9,[1]Exch2017!A21:IV21)","v":1.9258}]
["Belgium","Euro","EUR",{"$f":"LOOKUP(9^9,[1]Exch2017!A22:IV22)","v":0.83199999999999996}]
["Belize","Belize Dollar","BZD",{"$f":"LOOKUP(9^9,[1]Exch2017!A23:IV23)","v":1.9986999999999999}]
["Benin","CFA Franc","XOF",{"$f":"LOOKUP(9^9,[1]Exch2017!A24:IV24)","v":545.67600000000004}]
["Bermuda","Bermuda Dollar","BMD",{"$f":"LOOKUP(9^9,[1]Exch2017!A25:IV25)","v":1}]
["Bhutan","Ngultrum","BTN",{"$f":"LOOKUP(9^9,[1]Exch2017!A26:IV26)","v":64.02}]
["Bolivia","Boliviano","BOB",{"$f":"LOOKUP(9^9,[1]Exch2017!A27:IV27)","v":6.91}]
["Bosnia and Herzegovina","Conv. Mark","BAM",{"$f":"LOOKUP(9^9,[1]Exch2017!A28:IV28)","v":1.627}]
["Botswana","Pula","BWP",{"$f":"LOOKUP(9^9,[1]Exch2017!A29:IV29)","v":10.0806}]
["Brazil","Real","BRL",{"$f":"LOOKUP(9^9,[1]Exch2017!A30:IV30)","v":3.1709999999999998}]
["Brunei Darussalam","Brunei Dollar","BND",{"$f":"LOOKUP(9^9,[1]Exch2017!A31:IV31)","v":1.3520000000000001}]
["Bulgaria","New Leva","BGN",{"$f":"LOOKUP(9^9,[1]Exch2017!A32:IV32)","v":1.627}]
["Burkina Faso","CFA Franc","XOF",{"$f":"LOOKUP(9^9,[1]Exch2017!A33:IV33)","v":545.67600000000004}]
["Burundi","Burundi Franc","BIF",{"$f":"LOOKUP(9^9,[1]Exch2017!A34:IV34)","v":1728.0640000000001}]
["Cambodia","Riel","KHR",{"$f":"LOOKUP(9^9,[1]Exch2017!A35:IV35)","v":4080}]
["Cameroon","CFA Franc","XAF",{"$f":"LOOKUP(9^9,[1]Exch2017!A36:IV36)","v":545.67600000000004}]
["Canada","Canadian Dollar","CAD",{"$f":"LOOKUP(9^9,[1]Exch2017!A37:IV37)","v":1.25}]
["Cape Verde","Escudo","CVE",{"$f":"LOOKUP(9^9,[1]Exch2017!A38:IV38)","v":91.727000000000004}]
["Cayman Islands","Cayman Dollar","KYD",{"$f":"LOOKUP(9^9,[1]Exch2017!A39:IV39)","v":0.82}]
["Central African Republic","CFA Franc","XAF",{"$f":"LOOKUP(9^9,[1]Exch2017!A40:IV40)","v":545.67600000000004}]
{"$rows_left_out":173}